Error pins arduino h no such file or directory

«pins_arduino» not found #106

Comments

maxerd commented Oct 26, 2019

everytime i try to verify a programme I get the error saying «Error: Request compile failed with message: build failed: exit status 1»
when i look at «Arduino: daemon error» this comes up;

[INFO] In file included from C:\Users\maxja\AppData\Local\Temp\arduino-sketch-582A576645E1F7EDE1CA6E4439C98AD0\sketch\sketch_october26a.ino.cpp:1:0:
[INFO] C:\Users\maxja\AppData\Local\Arduino15\packages\arduino\hardware\avr\1.8.1\cores\arduino/Arduino.h:257:10: fatal error: pins_arduino.h: No such file or directory
[INFO] #include «pins_arduino.h»
[INFO] ^

[INFO] compilation terminated.

because of this i cant code or upload anything .

I expect its something that is wrong on my pc or on my own part because i have not seen anyone on here that has reported the some problem.


the image above is what i get when i open the programme(i got the error for the first time with v0.0.2)


the image above is error as shown in «Arduino: daemon error»

The text was updated successfully, but these errors were encountered:

Источник

How to solve this arduino error-error: pins_arduino.h: No such file or directory

how do I solve this error on my Arduino sketch,

In file included from sketch_feb14a.cpp:20: G:\arduino-1.0-windows_2\arduino-1.0\hardware\arduino\cores\arduino/Arduino.h:212:26: error: pins_arduino.h: No such file or directory

4 Answers 4

For the breadboard example I added this to the boards.txt that comes with the breadboard sample.

Double check what board you have configured in the IDE, Tools->Board The pins file defines the pin configuration of your Arduino board.

If that’s not it, then try a new install of the IDE.

to boards.txt for the code to work in arduino uno.

It is boot loader crashed issue. Error come in below situations

  1. IDE you downloaded is not proper
  2. you have not configured comport or not selected Board you are working on
  3. If above two steps properly done, that means you have uploaded program while loop/infinte loop which made boot loader to get hang. 4.Include watchdog timer to get read of the problem again and again , after uploading boot loader
  4. you will get avr Pocket programmer for burning bootloader

Hot Network Questions

Subscribe to RSS

To subscribe to this RSS feed, copy and paste this URL into your RSS reader.

Site design / logo © 2022 Stack Exchange Inc; user contributions licensed under CC BY-SA . rev 2022.10.7.15380

By clicking “Accept all cookies”, you agree Stack Exchange can store cookies on your device and disclose information in accordance with our Cookie Policy.

Источник

Arduino.ru

Arduino 1.6.0 Ошибка компиляции при любом проекте

  • Войдите или зарегистрируйтесь, чтобы получить возможность отправлять комментарии

Установил Arduino 1.6.0

при компиляции чего угодно выдает такое сообщение (как исправить?):

  • Войдите или зарегистрируйтесь, чтобы получить возможность отправлять комментарии

похоже на этом форуме ответа не дождусь (

  • Войдите или зарегистрируйтесь, чтобы получить возможность отправлять комментарии

Подождите ещё немного и дождётесь ;)

Совет номер раз: Включите в настройках подробный отчёт о компиляции. Посмотрите ошибки.

Можете сюда запостить, только вставляйте ОБЯЗАТЕЛЬНО как код, а то заклюют и народ обидится- он у нас здесь мягкий и жутко ранимый

  • Войдите или зарегистрируйтесь, чтобы получить возможность отправлять комментарии

Подождите ещё немного и дождётесь ;)

Совет номер раз: Включите в настройках подробный отчёт о компиляции. Посмотрите ошибки.

Можете сюда запостить, только вставляйте ОБЯЗАТЕЛЬНО как код, а то заклюют и народ обидится- он у нас здесь мягкий и жутко ранимый

это точно. а какими быть должны быть ардуинщики? в кожанных куртках кататься на байках каждый?

  • Войдите или зарегистрируйтесь, чтобы получить возможность отправлять комментарии

Пальцем в небо — пробелы в именах каталогов. Я так никогда не делаю, потому не знаю, влияет это или нет.

  • Войдите или зарегистрируйтесь, чтобы получить возможность отправлять комментарии

И, заметьте, уже давно живём без мата! К нам даже женщины заходят! Правда редко.

О чём это я ? Ах , да , а где подробности компиляции ?

sg6336. Ауууууууу. Группа поддержки уже готова! ( первый плюс kisoft-y)

  • Войдите или зарегистрируйтесь, чтобы получить возможность отправлять комментарии

Подскажите кто нибудь, беру этот скетч https://dl.dropboxusercontent.com/u/21892130/121118%20-%20LED%20Cube/LED. а он не компилируется, не могу разобраться с ошибками, помогите исправить

  • Войдите или зарегистрируйтесь, чтобы получить возможность отправлять комментарии

sketch_feb15a.ino:10:1: error: ‘prog_uchar’ does not name a type
sketch_feb15a.ino: In function ‘void loop()’:
sketch_feb15a.ino:447:23: error: ‘PatternTable’ was not declared in this scope
Ошибка компиляции.

  • Войдите или зарегистрируйтесь, чтобы получить возможность отправлять комментарии

prog_uchar заменить на const unsigned char

  • Войдите или зарегистрируйтесь, чтобы получить возможность отправлять комментарии

sketch_feb15a.ino:10:1: error: ‘prog_uchar’ does not name a type
sketch_feb15a.ino: In function ‘void loop()’:
sketch_feb15a.ino:447:23: error: ‘PatternTable’ was not declared in this scope
Ошибка компиляции.

Добавьте самой первой строкой:

поскольку prog_uchar deprecated.

И добавьте слово const в десятой строке:

PS После того как увидел «Вгрузить» в 1.6.0 вместо Upload, переключился на ангельский язык. Я уже не говорю про эскизы. За такие художества нужно убивать.

UPD: Разумеется это только один вариант решения. Другой — заменить prog_char на другой тип.

Источник

Ошибка компиляции в Arduino

Даже опытные программисты-«ардуинщики» могут столкнуться с ошибками компиляции. Исправить их не сложно, а вот найти порой не так просто. Мы решили рассказать сегодня в деталях, какие системные ошибки чаще возникают на различных платах Ардуино, как их исправить и по возможности избежать.

Для начала рассмотрим базовые, так называемые синтаксические ошибки. Они встречаются чаще всего у новичков, но и опытные электронщики с ними точно знакомы не понаслышке. Искать их обычно супер-просто – в Arduino IDE некорректный синтаксис выделяется построчно (таким образом значительно легче отыскать неточность в кодах). Обычно это: отсутствие скобки в конце команды, пропуск этой самой служебной команды или слова, нехватка важных функций, неправильное их написание и т.д.

Для быстрого поиска ошибки советуем рассмотреть строку-подсказку. Ничего не помогло? Тогда для вас наша подборка наиболее распространенных синтаксических ошибок:

  • Такое сообщение указывает на то, что вы забыли открыть фугурную скобку;
  • “expected initializer before ‘>’ token” — наоборот, забыли ее закрыть;
  • “undefined reference to “setup” — удалена либо изменена процедура “setup”;
  • undefinedreferenceto “loop” – проблема с опцией loop (ненароком изменили, удалили);
  • Тут говорится о том, что в прошивке найдены слова, написанные неверно (текст, который не должен считаться программным, все же читается средой IDE).

С синтаксисом все понятно – вставляем пропущенные символы, убираем лишние знаки, возвращаем функции по умолчанию.
Напомним, в среде разработки Ардуино IDE можно заливать скетчи для различных микроконтроллеров. По умолчанию обычно указана плата Genuino Uno. Если вы работаете с Mega, следует выбрать именно эту платформу (меню «Сервис»), иначе вас ожидает неприятное предупреждение: “programmer is not responding”.

Ошибка компиляции для платы Arduino Uno чаще всего возникает из-за проблем, связанных с библиотеками, например, неправильно подключили, не то ПО инсталлировали. В этом случае вы увидите напоминание fatal error: … No such file or directory” (библиотека не перенесена в папку libraries) или redefinition of void setup”.


Обозначенная на скриншоте ERROR означает, что программирование завершилось некорректно (расшифровываем: внутренние проблемы с компилятором, не обновили версию IDE, сбой в библиотеке, неправильный выбор разрядности операционной системы и др.).
Важно! Не забывайте использовать подсказки приложения – они очень помогают. Включаем тут: Файл -> Настройки -> «Показать подробный вывод во время компиляции».

Что делать, если произошла ошибка при загрузке скетча Arduino Nano. Тут могут быть те же причины, что мы описали выше. Особых отличий в компиляции плат нет, главное, их правильный выбор первоначально. Однако часто пользователи настраивают не те показатели скорости порта: 9600 вместо необходимых 57600 либо не имеют соответствующих драйверов на устройствах – все это нужно проверить и исправить!

Источник

Arduino.h: No such file or directory #4609

Comments

tsctrl commented Dec 6, 2020 •

I have idf 4.2 relese branch with arduino lib 4.2 release branch as component manually added under component/arduino folder inside my project.

  • i have issue with variable undefined where i have to remove all this lib from my project to build:
    libraries/LITTLEFS/
    libraries/WiFiProv/

This is mostly because my library are pointing to idf installation folder. But the variables are in arduino component sdk folder.
Not sure how to fix, should i override idf components or how to make my arduino library referring to the sdk under the arduino component folder?
Once i am able to build, i created blink project where the project works and able to fire the tiny led at the esp32 devkitc board.

I created new libraries with .cpp (in src) and .h (in includes folder).
.h files are c++ classes with pubic functions.
.cpp is only function implementation that includes .h classes.
.h will be included in the app_main.cpp main class.

  • basically standard c++ arduino library implementation.

system( Hardware, computer, O/S, core version, environment):
Windows. ESP32 devkit C.

Describe what is failing:
I am not able to include any Arduino library into my cpp/h files in my components. I think i miss some declaration somewhare?

Build error:
../components/test/include/test.h:19:10: fatal error: Arduino.h: No such file or directory
fatal error: SPI.h: No such file or directory etc

If i remove #include

CMakeLists:
idf_component_register(
SRCS «src/test.cpp»
INCLUDE_DIRS «./include»
)

The text was updated successfully, but these errors were encountered:

Источник

Adblock
detector